BDBM155546 US9012461, 22
SMILES NC(=O)Cc1ccccc1CCc1nc(Nc2ccc(cc2)C2CNCCO2)ncc1C(F)(F)F
InChI Key InChIKey=HODRRKNPKSMDAR-UHFFFAOYSA-N
Data  3 IC50  1 Kd
  Tab Delimited (TSV)   2D SDfile   Computed 3D by Vconf -m prep SDfile
Find this compound or compounds like it in BindingDB:
Activity Spreadsheet -- Enzyme Inhibition Constant Data from BindingDB
Found 4 hits for monomerid = 155546
TargetFocal adhesion kinase 1(Homo sapiens (Human))
Cancer Therapeutics Crc
US Patent
LigandPNGBDBM155546(US9012461, 22)
Affinity DataIC50:  2.80nMpH: 7.4Assay Description:A biotin labeled peptide is used as substrate (amino acid sequence: Biotin-Glu-Gly-Pro-Trp-Leu-Glu-Glu-Glu-Glu-Glu-Ala-Tyr-Gly-Trp-Met-Asp-Phe-NH2)1S...
Ligand InfoPC cidPC sid
In DepthDetails US Patent
TargetFocal adhesion kinase 1(Homo sapiens (Human))
Cancer Therapeutics Crc
US Patent
LigandPNGBDBM155546(US9012461, 22)
Affinity DataIC50:  30nMT: 2°C. Assay description: Adult human dermal lymphatic microvascular endothelial cells (HMVEC-dLyAD) (Cat# CC-2810, Lonza) were seeded into clear-bottom, TC treated 12 well pl...
Ligand InfoPC cidPC sid
In DepthDetails US Patent
TargetFocal adhesion kinase 1(Homo sapiens (Human))
Cancer Therapeutics Crc
US Patent
LigandPNGBDBM155546(US9012461, 22)
Affinity DataIC50:  15nMpH: 7.0Assay Description:Compounds of the invention may be tested for in vitro activity in the following assay: A biotin labeled peptide is used as substrate (amino acid sequ...
Ligand InfoPC cidPC sid
In DepthDetails US Patent
TargetFocal adhesion kinase 1(Homo sapiens (Human))
Cancer Therapeutics Crc
US Patent
LigandPNGBDBM155546(US9012461, 22)
Affinity DataKd:  0.990nMpH: 7.4 T: 2°C. Assay description: Binding parameters of compounds were determined using a Biacore S51 sensor. An anti-GST antibody was immobilized onto a CM5 chip by primary amine-cou...
Ligand InfoPC cidPC sid
In DepthDetails US Patent