BDBM15577 2-[(1R)-1-amino-2-(2,4,5-trifluorophenyl)ethyl]-1-[3-(trifluoromethyl)-5H,6H,7H,8H-[1,2,4]triazolo[3,4-a]pyrazin-7-yl]pent-4-en-1-one::DPP-4 ligand 19
SMILES N[C@H](Cc1cc(F)c(F)cc1F)C(CC=C)C(=O)N1CCn2c(C1)nnc2C(F)(F)F
InChI Key InChIKey=IBMCNISGWCTXGJ-JOPIAHFSSA-N
Data  1 IC50
  Tab Delimited (TSV)   2D SDfile   Computed 3D by Vconf -m prep SDfile
Find this compound or compounds like it in BindingDB:
Activity Spreadsheet -- Enzyme Inhibition Constant Data from BindingDB
Found 1 hit for monomerid = 15577
TargetDipeptidyl peptidase 4(Homo sapiens (Human))
Merck Research Laboratories
LigandPNGBDBM15577(2-[(1R)-1-amino-2-(2,4,5-trifluorophenyl)ethyl]-1-...)
Affinity DataIC50:  2.00E+3nMpH: 7.5 T: 2°C. Assay description: The enzyme activity resulted in the formation of the fluorescent product amidomethylcoumarin (AMC), which was monitored by excitation at 360 nm and m...
In DepthDetails ArticlePubMed