BDBM155801 US9012651, 245
SMILES CC(C)[C@H](CO)NCc1nc(ccc1F)-c1ccc(F)c(F)c1F
InChI Key InChIKey=WJXGZRGGRLBLEY-HNNXBMFYSA-N
Data  1 IC50
  Tab Delimited (TSV)   2D SDfile   Computed 3D by Vconf -m prep SDfile
Find this compound or compounds like it in BindingDB:
Activity Spreadsheet -- Enzyme Inhibition Constant Data from BindingDB
Found 1 hit for monomerid = 155801
TargetTransient receptor potential cation channel subfamily V member 3(Homo sapiens (Human))
Abbvie
US Patent
LigandPNGBDBM155801(US9012651, 245)
Affinity DataIC50:  160nM. Assay description: Experiments were conducted using the FLIPRTETRAŽ. On the day prior to the experiment, recombinant HEK293 cells that stably express human and mouse TR...
In DepthDetails US Patent