BDBM15582 N-Phenyl-1H-pyrrole-2-carboxamide::pyrrole inhibitor 8
SMILES O=C(Nc1ccccc1)c1ccc[nH]1
InChI Key InChIKey=MZPAQCAPWLAKSD-UHFFFAOYSA-N
Data  3 KI
  Tab Delimited (TSV)   2D SDfile   Computed 3D by Vconf -m prep SDfile
Find this compound or compounds like it in BindingDB:
Activity Spreadsheet -- Enzyme Inhibition Constant Data from BindingDB
Found 3 hits for monomerid = 15582
TargetAmine oxidase [flavin-containing] A(Bos taurus)
Sapienza University Of Rome
LigandPNGBDBM15582(N-Phenyl-1H-pyrrole-2-carboxamide | pyrrole inhibi...)
Affinity DataKi:  400nM ΔG°:  -9.10kcal/molepH: 7.4 T: 2°C. Assay description: MAO A and MAO B activities were determined spectrophotometrically using kinuramine as substrates. Fluorimetric measurements were recorded with a Perk...
In DepthDetails ArticlePubMed
TargetAmine oxidase [flavin-containing] B(Bos taurus)
Sapienza University Of Rome
LigandPNGBDBM15582(N-Phenyl-1H-pyrrole-2-carboxamide | pyrrole inhibi...)
Affinity DataKi: >1.00E+5nM. Assay description: MAO A and MAO B activities were determined spectrophotometrically using kinuramine as substrates. Fluorimetric measurements were recorded with a Perk...
In DepthDetails ArticlePubMed
TargetAmine oxidase [flavin-containing] A(Homo sapiens (Human))
Bharati Vidyapeeth Deemed University
Curated by ChEMBL
LigandPNGBDBM15582(N-Phenyl-1H-pyrrole-2-carboxamide | pyrrole inhibi...)
Affinity DataKi:  4.00E+8nM. Assay description: Inhibition of MAO-A receptor
In DepthDetails ArticlePubMed