BDBM15584 CHEMBL352538::N-Benzyl,N-methyl-1H-pyrrole-2-carboxamide::N-benzyl-N-methyl-1H-pyrrole-2-carboxamide::pyrrole inhibitor 10
SMILES CN(Cc1ccccc1)C(=O)c1ccc[nH]1
InChI Key InChIKey=HDVIQRKATXBZHO-UHFFFAOYSA-N
Data  5 KI
  Tab Delimited (TSV)   2D SDfile   Computed 3D by Vconf -m prep SDfile
Find this compound or compounds like it in BindingDB:
Activity Spreadsheet -- Enzyme Inhibition Constant Data from BindingDB
Found 5 hits for monomerid = 15584
TargetAmine oxidase [flavin-containing] A(Bos taurus)
Sapienza University Of Rome
Curated by ChEMBL
LigandPNGBDBM15584(CHEMBL352538 | N-Benzyl,N-methyl-1H-pyrrole-2-carb...)
Affinity DataKi:  600nM. Assay description: Inhibitory activity against monoamine oxidase A in isolated bovine brain mitochondria
In DepthDetails ArticlePubMed
TargetAmine oxidase [flavin-containing] A(Bos taurus)
Sapienza University Of Rome
Curated by ChEMBL
LigandPNGBDBM15584(CHEMBL352538 | N-Benzyl,N-methyl-1H-pyrrole-2-carb...)
Affinity DataKi:  600nM ΔG°:  -8.85kcal/molepH: 7.4 T: 2°C. Assay description: MAO A and MAO B activities were determined spectrophotometrically using kinuramine as substrates. Fluorimetric measurements were recorded with a Perk...
In DepthDetails ArticlePubMed
TargetAmine oxidase [flavin-containing] B(Bos taurus)
Sapienza University Of Rome
LigandPNGBDBM15584(CHEMBL352538 | N-Benzyl,N-methyl-1H-pyrrole-2-carb...)
Affinity DataKi:  1.50E+5nM. Assay description: MAO A and MAO B activities were determined spectrophotometrically using kinuramine as substrates. Fluorimetric measurements were recorded with a Perk...
In DepthDetails ArticlePubMed
TargetAmine oxidase [flavin-containing] B(Bos taurus)
Sapienza University Of Rome
LigandPNGBDBM15584(CHEMBL352538 | N-Benzyl,N-methyl-1H-pyrrole-2-carb...)
Affinity DataKi:  3.00E+5nM. Assay description: Inhibitory activity against monoamine oxidase B in isolated bovine brain mitochondria
In DepthDetails ArticlePubMed
TargetAmine oxidase [flavin-containing] A(Homo sapiens (Human))
Bharati Vidyapeeth Deemed University
Curated by ChEMBL
LigandPNGBDBM15584(CHEMBL352538 | N-Benzyl,N-methyl-1H-pyrrole-2-carb...)
Affinity DataKi:  6.00E+8nM. Assay description: Inhibition of MAO-A receptor
In DepthDetails ArticlePubMed