BDBM15600 (R,S)-N-methyl,N-(R-phenylethyl)-1H-pyrrole-2-carboxamide::N-methyl-N-(1-phenylethyl)-1H-pyrrole-2-carboxamide::pyrrole inhibitor 25
SMILES CC(N(C)C(=O)c1ccc[nH]1)c1ccccc1
InChI Key InChIKey=MNAJWQKBXWQTKI-UHFFFAOYSA-N
Data  2 KI
  Tab Delimited (TSV)   2D SDfile   Computed 3D by Vconf -m prep SDfile
Find this compound or compounds like it in BindingDB:
Activity Spreadsheet -- Enzyme Inhibition Constant Data from BindingDB
Found 2 hits for monomerid = 15600
TargetAmine oxidase [flavin-containing] A(Bos taurus)
Sapienza University Of Rome
LigandPNGBDBM15600((R,S)-N-methyl,N-(R-phenylethyl)-1H-pyrrole-2-carb...)
Affinity DataKi:  10nM. Assay description: MAO A and MAO B activities were determined spectrophotometrically using kinuramine as substrates. Fluorimetric measurements were recorded with a Perk...
In DepthDetails ArticlePubMed
TargetAmine oxidase [flavin-containing] B(Bos taurus)
Sapienza University Of Rome
LigandPNGBDBM15600((R,S)-N-methyl,N-(R-phenylethyl)-1H-pyrrole-2-carb...)
Affinity DataKi:  4.50E+3nM. Assay description: MAO A and MAO B activities were determined spectrophotometrically using kinuramine as substrates. Fluorimetric measurements were recorded with a Perk...
In DepthDetails ArticlePubMed