BDBM156258 US9018217, 5,7-dimethyl-2((1-methyl-4-phenyl-1H-imidazol-2-ylthio)methyl)imidazo[1,2-a]pyrimidine::US9592230, 5,7-dimethyl-2-((1-methyl-4-phenyl-1H-imidazol-2-ylthio)methyl)imidazo[1,2-a]pyrimidine
SMILES Cc1cc(C)n2cc(CSc3nc(cn3C)-c3ccccc3)nc2n1
InChI Key InChIKey=PHRXKMLPVHCGBS-UHFFFAOYSA-N
Data  2 IC50
PDB links: 1 PDB ID matches this monomer.
  Tab Delimited (TSV)   2D SDfile   Computed 3D by Vconf -m prep SDfile
Find this compound or compounds like it in BindingDB:
Activity Spreadsheet -- Enzyme Inhibition Constant Data from BindingDB
Found 2 hits for monomerid = 156258
TargetcAMP and cAMP-inhibited cGMP 3',5'-cyclic phosphodiesterase 10A(Homo sapiens (Human))
H. Lundbeck
US Patent
LigandPNGBDBM156258(US9018217, 5,7-dimethyl-2((1-methyl-4-phenyl-1H-im...)
Affinity DataIC50:  20nM. Assay description: A PDE10A assay may for example, be performed as follows: The assay is performed in 60 uL samples containing a fixed amount of the relevant PDE enzyme...
TargetcAMP and cAMP-inhibited cGMP 3',5'-cyclic phosphodiesterase 10A(Homo sapiens (Human))
H. Lundbeck
US Patent
LigandPNGBDBM156258(US9018217, 5,7-dimethyl-2((1-methyl-4-phenyl-1H-im...)
Affinity DataIC50:  20nMT: 2°C. Assay description: A PDE10A assay may for example, be performed as follows: The assay is performed in 60 uL samples containing a fixed amount of the relevant PDE enzyme...