BDBM156265 US9018217, 5,7-Dimethyl-2-(1-methyl-4-phenyl-1H-imidazol-2-ylmethylsulfanyl)-[1,2,4]triazolo[1,5-a]pyridine::US9592230, 5,7-Dimethyl-2-(1-methyl-4-phenyl-1H-imidazol-2-ylmethylsulfanyl)-[1,2,4]triazolo[1,5-a]pyridine
SMILES Cc1cc(C)n2nc(SCc3nc(cn3C)-c3ccccc3)nc2c1
InChI Key InChIKey=IIJXNAFFHRCGGM-UHFFFAOYSA-N
Data  2 IC50
  Tab Delimited (TSV)   2D SDfile   Computed 3D by Vconf -m prep SDfile
Find this compound or compounds like it in BindingDB:
Activity Spreadsheet -- Enzyme Inhibition Constant Data from BindingDB
Found 2 hits for monomerid = 156265
TargetcAMP and cAMP-inhibited cGMP 3',5'-cyclic phosphodiesterase 10A(Homo sapiens (Human))
H. Lundbeck
US Patent
LigandPNGBDBM156265(US9018217, 5,7-Dimethyl-2-(1-methyl-4-phenyl-1H-im...)
Affinity DataIC50:  61nM. Assay description: A PDE10A assay may for example, be performed as follows: The assay is performed in 60 uL samples containing a fixed amount of the relevant PDE enzyme...
In DepthDetails US Patent
TargetcAMP and cAMP-inhibited cGMP 3',5'-cyclic phosphodiesterase 10A(Homo sapiens (Human))
H. Lundbeck
US Patent
LigandPNGBDBM156265(US9018217, 5,7-Dimethyl-2-(1-methyl-4-phenyl-1H-im...)
Affinity DataIC50:  61nMT: 2°C. Assay description: A PDE10A assay may for example, be performed as follows: The assay is performed in 60 uL samples containing a fixed amount of the relevant PDE enzyme...
In DepthDetails US Patent