BDBM156279 US9018217, 2-(1-Ethyl-4-phenyl-1H-imidazol-2-ylsulfanylmethyl)-5,7-dimethyl-imidazo[1,2-a]pyrimidine::US9592230, 2-(1-Ethyl-4-phenyl-1H-imidazol-2-ylsulfanylmethyl)-5,7-dimethyl-imidazo[1,2-a]pyrimidine
SMILES CCn1cc(nc1SCc1cn2c(C)cc(C)nc2n1)-c1ccccc1
InChI Key InChIKey=QTQIXWRUNFIPQS-UHFFFAOYSA-N
Data  2 IC50
  Tab Delimited (TSV)   2D SDfile   Computed 3D by Vconf -m prep SDfile
Find this compound or compounds like it in BindingDB:
Activity Spreadsheet -- Enzyme Inhibition Constant Data from BindingDB
Found 2 hits for monomerid = 156279
TargetcAMP and cAMP-inhibited cGMP 3',5'-cyclic phosphodiesterase 10A(Homo sapiens (Human))
H. Lundbeck
US Patent
LigandPNGBDBM156279(US9018217, 2-(1-Ethyl-4-phenyl-1H-imidazol-2-ylsul...)
Affinity DataIC50:  100nM. Assay description: A PDE10A assay may for example, be performed as follows: The assay is performed in 60 uL samples containing a fixed amount of the relevant PDE enzyme...
In DepthDetails US Patent
TargetcAMP and cAMP-inhibited cGMP 3',5'-cyclic phosphodiesterase 10A(Homo sapiens (Human))
H. Lundbeck
US Patent
LigandPNGBDBM156279(US9018217, 2-(1-Ethyl-4-phenyl-1H-imidazol-2-ylsul...)
Affinity DataIC50:  100nMT: 2°C. Assay description: A PDE10A assay may for example, be performed as follows: The assay is performed in 60 uL samples containing a fixed amount of the relevant PDE enzyme...
In DepthDetails US Patent