BDBM156285 US9018217, 2-[4-(4-Fluoro-phenyl)-1-methyl-1H-imidazol-2-ylmethylsulfanyl]-5,7-dimethyl-[1,2,4]triazolo[1,5-a]pyridine::US9592230, 2-[4-(4-Fluoro-phenyl)-1-methyl-1H-imidazol-2-ylmethylsulfanyl]-5,7-dimethyl-[1,2,4]triazolo[1,5-a]pyridine
SMILES Cc1cc(C)n2nc(SCc3nc(cn3C)-c3ccc(F)cc3)nc2c1
InChI Key InChIKey=BQCQGORETGJNHC-UHFFFAOYSA-N
Data  2 IC50
  Tab Delimited (TSV)   2D SDfile   Computed 3D by Vconf -m prep SDfile
Find this compound or compounds like it in BindingDB:
Activity Spreadsheet -- Enzyme Inhibition Constant Data from BindingDB
Found 2 hits for monomerid = 156285
TargetcAMP and cAMP-inhibited cGMP 3',5'-cyclic phosphodiesterase 10A(Homo sapiens (Human))
H. Lundbeck
US Patent
LigandPNGBDBM156285(US9018217, 2-[4-(4-Fluoro-phenyl)-1-methyl-1H-imid...)
Affinity DataIC50:  180nM. Assay description: A PDE10A assay may for example, be performed as follows: The assay is performed in 60 uL samples containing a fixed amount of the relevant PDE enzyme...
In DepthDetails US Patent
TargetcAMP and cAMP-inhibited cGMP 3',5'-cyclic phosphodiesterase 10A(Homo sapiens (Human))
H. Lundbeck
US Patent
LigandPNGBDBM156285(US9018217, 2-[4-(4-Fluoro-phenyl)-1-methyl-1H-imid...)
Affinity DataIC50:  180nMT: 2°C. Assay description: A PDE10A assay may for example, be performed as follows: The assay is performed in 60 uL samples containing a fixed amount of the relevant PDE enzyme...
In DepthDetails US Patent