BDBM156306 US9018217, 2-(1-Methyl-4-phenyl-1H-imidazol-2-ylmethylsulfanyl)-1H-imidazo[4,5-b]pyridine::US9592230, 2-(1-Methyl-4-phenyl-1H-imidazol-2-ylmethylsulfanyl)-1H-imidazo[4,5-b]pyridine
SMILES Cn1cc(nc1CSc1nc2ncccc2[nH]1)-c1ccccc1
InChI Key InChIKey=HYAWVZKQNFFTTA-UHFFFAOYSA-N
Data  2 IC50
  Tab Delimited (TSV)   2D SDfile   Computed 3D by Vconf -m prep SDfile
Find this compound or compounds like it in BindingDB:
Activity Spreadsheet -- Enzyme Inhibition Constant Data from BindingDB
Found 2 hits for monomerid = 156306
TargetcAMP and cAMP-inhibited cGMP 3',5'-cyclic phosphodiesterase 10A(Homo sapiens (Human))
H. Lundbeck
US Patent
LigandPNGBDBM156306(US9018217, 2-(1-Methyl-4-phenyl-1H-imidazol-2-ylme...)
Affinity DataIC50:  840nM. Assay description: A PDE10A assay may for example, be performed as follows: The assay is performed in 60 uL samples containing a fixed amount of the relevant PDE enzyme...
Ligand InfoPC cidPC sid
In DepthDetails US Patent
TargetcAMP and cAMP-inhibited cGMP 3',5'-cyclic phosphodiesterase 10A(Homo sapiens (Human))
H. Lundbeck
US Patent
LigandPNGBDBM156306(US9018217, 2-(1-Methyl-4-phenyl-1H-imidazol-2-ylme...)
Affinity DataIC50:  840nMT: 2°C. Assay description: A PDE10A assay may for example, be performed as follows: The assay is performed in 60 uL samples containing a fixed amount of the relevant PDE enzyme...
Ligand InfoPC cidPC sid
In DepthDetails US Patent