BDBM156323 US9018217, 4-(2-(2-((5-chloro-[1,2,4]triazolo[1,5-a]pyridin-2-yl)methylthio)-4-phenyl-1H-imidazol-1-yl)ethyl)morpholine::US9592230, 4-(2-(2-((5-chloro-[1,2,4]triazolo[1,5-a]pyridin-2-yl)methylthio)-4-phenyl-1H-imidazol-1-yl)ethyl)morpholine
SMILES Clc1cccc2nc(CSc3nc(cn3CCN3CCOCC3)-c3ccccc3)nn12
InChI Key InChIKey=LCILUUPJCUZZCG-UHFFFAOYSA-N
Data  2 IC50
  Tab Delimited (TSV)   2D SDfile   Computed 3D by Vconf -m prep SDfile
Find this compound or compounds like it in BindingDB:
Activity Spreadsheet -- Enzyme Inhibition Constant Data from BindingDB
Found 2 hits for monomerid = 156323
TargetcAMP and cAMP-inhibited cGMP 3',5'-cyclic phosphodiesterase 10A(Homo sapiens (Human))
H. Lundbeck
US Patent
LigandPNGBDBM156323(US9018217, 4-(2-(2-((5-chloro-[1,2,4]triazolo[1,5-...)
Affinity DataIC50:  33nM. Assay description: A PDE10A assay may for example, be performed as follows: The assay is performed in 60 uL samples containing a fixed amount of the relevant PDE enzyme...
In DepthDetails US Patent
TargetcAMP and cAMP-inhibited cGMP 3',5'-cyclic phosphodiesterase 10A(Homo sapiens (Human))
H. Lundbeck
US Patent
LigandPNGBDBM156323(US9018217, 4-(2-(2-((5-chloro-[1,2,4]triazolo[1,5-...)
Affinity DataIC50:  33nMT: 2°C. Assay description: A PDE10A assay may for example, be performed as follows: The assay is performed in 60 uL samples containing a fixed amount of the relevant PDE enzyme...
In DepthDetails US Patent