BDBM156348 US9018217, 2-[2-(1-Isopropyl-4-phenyl-1H-imidazol-2-yl)-ethyl]-5,7-dimethyl-[1,2,4]triazolo[1,5-a]pyrimidine::US9592230, 2-[2-(1-Isopropyl-4-phenyl-1H-imidazol-2-yl)-ethyl]-5,7-dimethyl-[1,2,4]triazolo[1,5-a]pyrimidine
SMILES CC(C)n1cc(nc1CCc1nc2nc(C)cc(C)n2n1)-c1ccccc1
InChI Key InChIKey=IYKCKOUTXZATNH-UHFFFAOYSA-N
Data  2 IC50
  Tab Delimited (TSV)   2D SDfile   Computed 3D by Vconf -m prep SDfile
Find this compound or compounds like it in BindingDB:
Activity Spreadsheet -- Enzyme Inhibition Constant Data from BindingDB
Found 2 hits for monomerid = 156348
TargetcAMP and cAMP-inhibited cGMP 3',5'-cyclic phosphodiesterase 10A(Homo sapiens (Human))
H. Lundbeck
US Patent
LigandPNGBDBM156348(US9018217, 2-[2-(1-Isopropyl-4-phenyl-1H-imidazol-...)
Affinity DataIC50:  3.40nM. Assay description: A PDE10A assay may for example, be performed as follows: The assay is performed in 60 uL samples containing a fixed amount of the relevant PDE enzyme...
In DepthDetails US Patent
TargetcAMP and cAMP-inhibited cGMP 3',5'-cyclic phosphodiesterase 10A(Homo sapiens (Human))
H. Lundbeck
US Patent
LigandPNGBDBM156348(US9018217, 2-[2-(1-Isopropyl-4-phenyl-1H-imidazol-...)
Affinity DataIC50:  3.40nMT: 2°C. Assay description: A PDE10A assay may for example, be performed as follows: The assay is performed in 60 uL samples containing a fixed amount of the relevant PDE enzyme...
In DepthDetails US Patent