BDBM156357 US9018217, 7-Methoxy-5,8-dimethyl-2-[2-(1-methyl-4-phenyl-1H-imidazol-2-yl)-ethyl]-[1,2,4]triazolo[1,5-c]pyrimidine::US9592230, 7-Methoxy-5,8-dimethyl-2-[2-(1-methyl-4-phenyl-1H-imidazol-2-yl)-ethyl]-[1,2,4]triazolo[1,5-c]pyrimidine
SMILES COc1nc(C)n2nc(CCc3nc(cn3C)-c3ccccc3)nc2c1C
InChI Key InChIKey=UQWDRPUQGPNHEE-UHFFFAOYSA-N
Data  2 IC50
  Tab Delimited (TSV)   2D SDfile   Computed 3D by Vconf -m prep SDfile
Find this compound or compounds like it in BindingDB:
Activity Spreadsheet -- Enzyme Inhibition Constant Data from BindingDB
Found 2 hits for monomerid = 156357
TargetcAMP and cAMP-inhibited cGMP 3',5'-cyclic phosphodiesterase 10A(Homo sapiens (Human))
H. Lundbeck
US Patent
LigandPNGBDBM156357(US9018217, 7-Methoxy-5,8-dimethyl-2-[2-(1-methyl-4...)
Affinity DataIC50:  29nM. Assay description: A PDE10A assay may for example, be performed as follows: The assay is performed in 60 uL samples containing a fixed amount of the relevant PDE enzyme...
In DepthDetails US Patent
TargetcAMP and cAMP-inhibited cGMP 3',5'-cyclic phosphodiesterase 10A(Homo sapiens (Human))
H. Lundbeck
US Patent
LigandPNGBDBM156357(US9018217, 7-Methoxy-5,8-dimethyl-2-[2-(1-methyl-4...)
Affinity DataIC50:  29nMT: 2°C. Assay description: A PDE10A assay may for example, be performed as follows: The assay is performed in 60 uL samples containing a fixed amount of the relevant PDE enzyme...
In DepthDetails US Patent