BDBM156379 US10118915, Compound 293::US9682966, 214::US9682966, 293
SMILES COC1CN(CCC1NC1CCCCC1)c1nc2ccc(C)cc2cc1-c1nc(C)no1
InChI Key InChIKey=PGXSSLBJKPYNJE-UHFFFAOYSA-N
Data  4 IC50
  Tab Delimited (TSV)   2D SDfile   Computed 3D by Vconf -m prep SDfile
Find this compound or compounds like it in BindingDB:
Activity Spreadsheet -- Enzyme Inhibition Constant Data from BindingDB
Found 4 hits for monomerid = 156379
TargetKappa-type opioid receptor(Homo sapiens (Human))
The Scripps Research Institute
US Patent
LigandPNGBDBM156379(US10118915, Compound 293 | US9682966, 214 | US9682...)
Affinity DataIC50:  3nMT: 2°C. Assay description: The cell line for the OPRK1 antagonist assay stably expresses the following elements. The carboxy terminus of the OPRK1 receptor has a 7 amino acid l...
Ligand InfoPC cidPC sid
In DepthDetails US Patent
TargetKappa-type opioid receptor(Homo sapiens (Human))
The Scripps Research Institute
US Patent
LigandPNGBDBM156379(US10118915, Compound 293 | US9682966, 214 | US9682...)
Affinity DataIC50:  20nM. Assay description: Well-known assay for kappa opioid receptor
Ligand InfoPC cidPC sid
In DepthDetails US Patent
TargetKappa-type opioid receptor(Homo sapiens (Human))
The Scripps Research Institute
US Patent
LigandPNGBDBM156379(US10118915, Compound 293 | US9682966, 214 | US9682...)
Affinity DataIC50:  3nM. Assay description: Well-known assay for kappa opioid receptor
Ligand InfoPC cidPC sid
In DepthDetails US Patent
TargetKappa-type opioid receptor(Homo sapiens (Human))
The Scripps Research Institute
US Patent
LigandPNGBDBM156379(US10118915, Compound 293 | US9682966, 214 | US9682...)
Affinity DataIC50:  20nMT: 2°C. Assay description: The cell line for the OPRK1 antagonist assay stably expresses the following elements. The carboxy terminus of the OPRK1 receptor has a 7 amino acid l...
Ligand InfoPC cidPC sid
In DepthDetails US Patent