BDBM156424 US10118915, Compound 219::US9682966, 219
SMILES Cc1noc(n1)-c1cc2cc(C)ccc2nc1N1CCC(CC1)NC1CCCCC1
InChI Key InChIKey=UZJLZNLPEHXTRT-UHFFFAOYSA-N
Data  2 IC50
  Tab Delimited (TSV)   2D SDfile   Computed 3D by Vconf -m prep SDfile
Find this compound or compounds like it in BindingDB:
Activity Spreadsheet -- Enzyme Inhibition Constant Data from BindingDB
Found 2 hits for monomerid = 156424
TargetKappa-type opioid receptor(Homo sapiens (Human))
The Scripps Research Institute
US Patent
LigandPNGBDBM156424(US10118915, Compound 219 | US9682966, 219)
Affinity DataIC50:  3.5nM. Assay description: Well-known assay for kappa opioid receptor
Ligand InfoPC cidPC sid
In DepthDetails US Patent
TargetKappa-type opioid receptor(Homo sapiens (Human))
The Scripps Research Institute
US Patent
LigandPNGBDBM156424(US10118915, Compound 219 | US9682966, 219)
Affinity DataIC50:  3.5nMT: 2°C. Assay description: The cell line for the OPRK1 antagonist assay stably expresses the following elements. The carboxy terminus of the OPRK1 receptor has a 7 amino acid l...
Ligand InfoPC cidPC sid
In DepthDetails US Patent