BDBM15665 1-cyclohexyl-N-(4-ethoxyphenyl)-5-oxopyrrolidine-3-carboxamide::Pyrrolidine Carboxamide Compound s18
SMILES CCOc1ccc(NC(=O)C2CN(C3CCCCC3)C(=O)C2)cc1
InChI Key InChIKey=RUIKBMQCTTVZBY-UHFFFAOYSA-N
Data  1 IC50
  Tab Delimited (TSV)   2D SDfile   Computed 3D by Vconf -m prep SDfile
Find this compound or compounds like it in BindingDB:
Activity Spreadsheet -- Enzyme Inhibition Constant Data from BindingDB
Found 1 hit for monomerid = 15665
TargetEnoyl-[acyl-carrier-protein] reductase [NADH](Mycobacterium tuberculosis (strain ATCC 25618 / H3...)
University Of California San Francisco
LigandPNGBDBM15665(1-cyclohexyl-N-(4-ethoxyphenyl)-5-oxopyrrolidine-3...)
Affinity DataIC50: >1.00E+5nMpH: 6.8 T: 2°C. Assay description: The assay measured the NADH-dependent catalysis of an octenoyl-CoA substrate as a decrease in 340 nm absorbance resulting from conversion of NADH to ...
In DepthDetails ArticlePubMed