BDBM15667 1-cyclohexyl-N-(2,4-dichlorophenyl)-5-oxopyrrolidine-3-carboxamide::Pyrrolidine Carboxamide Compound d1
SMILES Clc1ccc(NC(=O)C2CN(C3CCCCC3)C(=O)C2)c(Cl)c1
InChI Key InChIKey=HRUILKRADWJGGN-UHFFFAOYSA-N
Data  1 IC50
  Tab Delimited (TSV)   2D SDfile   Computed 3D by Vconf -m prep SDfile
Find this compound or compounds like it in BindingDB:
Activity Spreadsheet -- Enzyme Inhibition Constant Data from BindingDB
Found 1 hit for monomerid = 15667
TargetEnoyl-[acyl-carrier-protein] reductase [NADH](Mycobacterium tuberculosis (strain ATCC 25618 / H3...)
University Of California San Francisco
LigandPNGBDBM15667(1-cyclohexyl-N-(2,4-dichlorophenyl)-5-oxopyrrolidi...)
Affinity DataIC50:  5.60E+4nM. Assay description: The assay measured the NADH-dependent catalysis of an octenoyl-CoA substrate as a decrease in 340 nm absorbance resulting from conversion of NADH to ...
In DepthDetails ArticlePubMed