BDBM15710 N-((Anthracen-9-yl)methyl)-1-cycloheptyl-N-methyl-5-oxopyrrolidine-3-carboxamide::N-(anthracen-9-ylmethyl)-1-cycloheptyl-N-methyl-5-oxopyrrolidine-3-carboxamide::Pyrrolidine Carboxamide Compound p65
SMILES CN(Cc1c2ccccc2cc2ccccc12)C(=O)C1CN(C2CCCCCC2)C(=O)C1
InChI Key InChIKey=PEBYNXCOJDHJFC-UHFFFAOYSA-N
Data  1 IC50
  Tab Delimited (TSV)   2D SDfile   Computed 3D by Vconf -m prep SDfile
Find this compound or compounds like it in BindingDB:
Activity Spreadsheet -- Enzyme Inhibition Constant Data from BindingDB
Found 1 hit for monomerid = 15710
TargetEnoyl-[acyl-carrier-protein] reductase [NADH](Mycobacterium tuberculosis (strain ATCC 25618 / H3...)
University Of California San Francisco
LigandPNGBDBM15710(N-((Anthracen-9-yl)methyl)-1-cycloheptyl-N-methyl-...)
Affinity DataIC50:  620nM. Assay description: The assay measured the NADH-dependent catalysis of an octenoyl-CoA substrate as a decrease in 340 nm absorbance resulting from conversion of NADH to ...
In DepthDetails ArticlePubMed