BDBM157185 US9023865, 31
SMILES C[C@@H](NC(=O)Nc1cc2[nH]nc(-c3cc(C)nc(C)c3)c2cn1)c1ccccc1
InChI Key
Data  7 IC50
  Tab Delimited (TSV)   2D SDfile   Computed 3D by Vconf -m prep SDfile
Find this compound or compounds like it in BindingDB:
Activity Spreadsheet -- Enzyme Inhibition Constant Data from BindingDB
Found 7 hits for monomerid = 157185
TargetMitogen-activated protein kinase 1(Homo sapiens (Human))
Merck Sharp & Dohme
US Patent
LigandPNGBDBM157185(US9023865, 31)
Affinity DataIC50:  0.290nM. Assay description: Activated ERK2 activity was determined in an IMAP-FP assay (Molecular Devices). Using this assay format, the potency (IC50) of each compound was dete...
In DepthDetails US Patent
TargetMitogen-activated protein kinase 1(Homo sapiens (Human))
Merck Sharp & Dohme
US Patent
LigandPNGBDBM157185(US9023865, 31)
Affinity DataIC50:  0.300nM. Assay description: Inhibition of human ERK2 preincubated for 15 mins followed by addition of IMAP peptide substrate and ATP measured after 60 mins by IMAP-FP assay
In DepthDetails ArticlePubMed
TargetPotassium voltage-gated channel subfamily H member 2(Homo sapiens (Human))
Merck
Curated by ChEMBL
LigandPNGBDBM157185(US9023865, 31)
Affinity DataIC50: >2.00E+4nM. Assay description: Inhibition of human ERG
In DepthDetails ArticlePubMed
TargetCytochrome P450 3A4(Homo sapiens (Human))
Merck
Curated by ChEMBL
LigandPNGBDBM157185(US9023865, 31)
Affinity DataIC50:  780nM. Assay description: Inhibition of CYP3A4 (unknown origin)
In DepthDetails ArticlePubMed
TargetPotassium voltage-gated channel subfamily H member 2(Homo sapiens (Human))
Merck
Curated by ChEMBL
LigandPNGBDBM157185(US9023865, 31)
Affinity DataIC50: >2.00E+4nM. Assay description: Inhibition of human ERG
In DepthDetails ArticlePubMed
TargetCytochrome P450 3A4(Homo sapiens (Human))
Merck
Curated by ChEMBL
LigandPNGBDBM157185(US9023865, 31)
Affinity DataIC50:  780nM. Assay description: Inhibition of CYP3A4 (unknown origin)
In DepthDetails ArticlePubMed
TargetMitogen-activated protein kinase 1(Homo sapiens (Human))
Merck Sharp & Dohme
US Patent
LigandPNGBDBM157185(US9023865, 31)
Affinity DataIC50:  0.300nM. Assay description: Inhibition of human ERK2 preincubated for 15 mins followed by addition of IMAP peptide substrate and ATP measured after 60 mins by IMAP-FP assay
In DepthDetails ArticlePubMed