BDBM158074 US9024044, 2::US9227949, 2::US9655879, 2
SMILES NC(=N)c1ccc(OC(=O)c2ccc(CC3(CCCC3)C(=O)N[C@@H](CC(O)=O)C(O)=O)s2)c(F)c1
InChI Key InChIKey=HXDKJHJAMFQXBA-HNNXBMFYSA-N
Data  6 KI
  Tab Delimited (TSV)   2D SDfile   Computed 3D by Vconf -m prep SDfile
Find this compound or compounds like it in BindingDB:
Activity Spreadsheet -- Enzyme Inhibition Constant Data from BindingDB
Found 6 hits for monomerid = 158074
TargetEnteropeptidase(Homo sapiens (Human))
Ajinomoto
US Patent
LigandPNGBDBM158074(US9024044, 2 | US9227949, 2 | US9655879, 2)
Affinity DataKi:  0.730nMpH: 8.0Assay Description:Using a 96 well plate (#3915, Costar), a test compound (25 μL), 400 mM Tris-HCl buffer (pH 8.0, 25 μL) and 0.5 mg/mL fluorescence enzyme su...
In DepthDetails US Patent
TargetEnteropeptidase(Homo sapiens (Human))
Ajinomoto
US Patent
LigandPNGBDBM158074(US9024044, 2 | US9227949, 2 | US9655879, 2)
Affinity DataKi:  0.730nMpH: 8.0Assay Description:Using a 96 well plate (#3915, Costar), a test compound (25 uL), 400 mM Tris-HCl buffer (pH 8.0, 25 uL) and 0.5 mg/mL, fluorescence enzyme substrate (...
In DepthDetails US Patent
TargetEnteropeptidase(Homo sapiens (Human))
Ajinomoto
US Patent
LigandPNGBDBM158074(US9024044, 2 | US9227949, 2 | US9655879, 2)
Affinity DataKi:  0.730nM. Assay description: Using a 96 well plate (#3915, Costar), a test compound (25 μL) was mixed with 20 μM fluorescence enzyme substrate (Boc-Phe-Ser-Arg-AMC, 50 ...
In DepthDetails US Patent
TargetSerine protease 1(Homo sapiens (Human))
Ajinomoto
US Patent
LigandPNGBDBM158074(US9024044, 2 | US9227949, 2 | US9655879, 2)
Affinity DataKi:  4.10nMpH: 8.0Assay Description:Using a 96 well plate (#3915, Costar), a test compound (25 uL) was mixed with 20 uM fluorescence enzyme substrate (Boc-Phe-Ser-Arg-AMC, 50 uL) mixed ...
In DepthDetails US Patent
TargetSerine protease 1(Homo sapiens (Human))
Ajinomoto
US Patent
LigandPNGBDBM158074(US9024044, 2 | US9227949, 2 | US9655879, 2)
Affinity DataKi:  4.10nM. Assay description: Using a 96 well plate (#3915, Costar), a test compound (25 μL), 400 mM Tris-HCl buffer (pH 8.0, 25 μL) and 0.5 mg/mL fluorescence enzyme su...
In DepthDetails US Patent
TargetSerine protease 1(Homo sapiens (Human))
Ajinomoto
US Patent
LigandPNGBDBM158074(US9024044, 2 | US9227949, 2 | US9655879, 2)
Affinity DataKi:  4.10nMpH: 8.0Assay Description:Using a 96 well plate (#3915, Costar), a test compound (25 μL) was mixed with 20 μM fluorescence enzyme substrate (Boc-Phe-Ser-Arg-AMC, 50 ...
In DepthDetails US Patent