BDBM15809 1:1 racemic mixture::2-[(4-{2-[(4-carboxybutyl)carbamoyl]-2-acetamidoethyl}-2-ethylphenyl)amidoformic acid]benzoic acid::oxalyl-aryl-amino benzoic acid-based inhibitor 8d
SMILES CCc1cc(CC(NC(C)=O)C(=O)NCCCCC(O)=O)ccc1N(C(=O)C(O)=O)c1ccccc1C(O)=O
InChI Key InChIKey=LENUCMQPYJPVKQ-UHFFFAOYSA-N
Data  2 KI
  Tab Delimited (TSV)   2D SDfile   Computed 3D by Vconf -m prep SDfile
Find this compound or compounds like it in BindingDB:
Activity Spreadsheet -- Enzyme Inhibition Constant Data from BindingDB
Found 2 hits for monomerid = 15809
TargetTyrosine-protein phosphatase non-receptor type 2(Homo sapiens (Human))
Abbott Laboratories
LigandPNGBDBM15809(1:1 racemic mixture | 2-[(4-{2-[(4-carboxybutyl)ca...)
Affinity DataKi:  2.20E+3nM. Assay description: The phosphatase activity resulted in the formation of the colored product p-nitrophenol, which was continuously monitored at 405 nm every 30 s for 15...
In DepthDetails ArticlePubMed
TargetTyrosine-protein phosphatase non-receptor type 1 [1-298](Homo sapiens (Human))
Abbott Laboratories
LigandPNGBDBM15809(1:1 racemic mixture | 2-[(4-{2-[(4-carboxybutyl)ca...)
Affinity DataKi:  2.50E+3nM ΔG°:  -7.56kcal/molepH: 7.5 T: 2°C. Assay description: The phosphatase activity resulted in the formation of the colored product p-nitrophenol, which was continuously monitored at 405 nm every 30 s for 15...
In DepthDetails ArticlePubMed