BDBM158108 US9024044, 36::US9227949, 36::US9655879, 36
SMILES CC(C)(Cc1ccc(s1)C(=O)Oc1ccc(cc1F)C(N)=N)C(=O)N[C@H](C1CCCCC1)C(O)=O
InChI Key InChIKey=YGHKECGTVWVLDI-HXUWFJFHSA-N
Data  6 KI
  Tab Delimited (TSV)   2D SDfile   Computed 3D by Vconf -m prep SDfile
Find this compound or compounds like it in BindingDB:
Activity Spreadsheet -- Enzyme Inhibition Constant Data from BindingDB
Found 6 hits for monomerid = 158108
TargetSerine protease 1(Homo sapiens (Human))
Ajinomoto
US Patent
LigandPNGBDBM158108(US9024044, 36 | US9227949, 36 | US9655879, 36)
Affinity DataKi:  3.07nMpH: 8.0Assay Description:Using a 96 well plate (#3915, Costar), a test compound (25 μL) was mixed with 20 μM fluorescence enzyme substrate (Boc-Phe-Ser-Arg-AMC, 50 ...
In DepthDetails US Patent
TargetSerine protease 1(Homo sapiens (Human))
Ajinomoto
US Patent
LigandPNGBDBM158108(US9024044, 36 | US9227949, 36 | US9655879, 36)
Affinity DataKi:  3.07nMpH: 8.0Assay Description:Using a 96 well plate (#3915, Costar), a test compound (25 uL) was mixed with 20 uM fluorescence enzyme substrate (Boc-Phe-Ser-Arg-AMC, 50 uL) mixed ...
In DepthDetails US Patent
TargetSerine protease 1(Homo sapiens (Human))
Ajinomoto
US Patent
LigandPNGBDBM158108(US9024044, 36 | US9227949, 36 | US9655879, 36)
Affinity DataKi:  3.07nM. Assay description: Using a 96 well plate (#3915, Costar), a test compound (25 μL), 400 mM Tris-HCl buffer (pH 8.0, 25 μL) and 0.5 mg/mL fluorescence enzyme su...
In DepthDetails US Patent
TargetEnteropeptidase(Homo sapiens (Human))
Ea Pharma
US Patent
LigandPNGBDBM158108(US9024044, 36 | US9227949, 36 | US9655879, 36)
Affinity DataKi:  4.70nM. Assay description: Using a 96 well plate (#3915, Costar), a test compound (25 μL) was mixed with 20 μM fluorescence enzyme substrate (Boc-Phe-Ser-Arg-AMC, 50 ...
In DepthDetails US Patent
TargetEnteropeptidase(Homo sapiens (Human))
Ea Pharma
US Patent
LigandPNGBDBM158108(US9024044, 36 | US9227949, 36 | US9655879, 36)
Affinity DataKi:  4.70nMpH: 8.0Assay Description:Using a 96 well plate (#3915, Costar), a test compound (25 μL), 400 mM Tris-HCl buffer (pH 8.0, 25 μL) and 0.5 mg/mL fluorescence enzyme su...
In DepthDetails US Patent
TargetEnteropeptidase(Homo sapiens (Human))
Ea Pharma
US Patent
LigandPNGBDBM158108(US9024044, 36 | US9227949, 36 | US9655879, 36)
Affinity DataKi:  4.70nMpH: 8.0Assay Description:Using a 96 well plate (#3915, Costar), a test compound (25 uL), 400 mM Tris-HCl buffer (pH 8.0, 25 uL) and 0.5 mg/mL, fluorescence enzyme substrate (...
In DepthDetails US Patent