BDBM158428 US9029399, 1A::US9339501, 1A
SMILES Clc1cc(ccn1)N1CCN(C1=O)c1cnccc1C1CC1
InChI Key InChIKey=QHIQLVPUVUOZHY-UHFFFAOYSA-N
Data  4 IC50
  Tab Delimited (TSV)   2D SDfile   Computed 3D by Vconf -m prep SDfile
Find this compound or compounds like it in BindingDB:
Activity Spreadsheet -- Enzyme Inhibition Constant Data from BindingDB
Found 4 hits for monomerid = 158428
TargetSteroid 17-alpha-hydroxylase/17,20 lyase(Homo sapiens (Human))
Novartis
US Patent
LigandPNGBDBM158428(US9029399, 1A | US9339501, 1A)
Affinity DataIC50:  8nMpH: 7.5Assay Description:Assay method was adopted from a published protocol with some modifications to suit our requirements (Dmitry N Grigoryev et al, Analytical Biochemistr...
In DepthDetails US Patent
TargetSteroid 17-alpha-hydroxylase/17,20 lyase(Rattus norvegicus (Rat))
Novartis
US Patent
LigandPNGBDBM158428(US9029399, 1A | US9339501, 1A)
Affinity DataIC50:  2.70nMpH: 7.5Assay Description:Assay method was adopted from a published protocol with some modifications to suit our requirements (Dmitry N Grigoryev et al, Analytical Biochemistr...
In DepthDetails US Patent
TargetSteroid 17-alpha-hydroxylase/17,20 lyase(Homo sapiens (Human))
Novartis
US Patent
LigandPNGBDBM158428(US9029399, 1A | US9339501, 1A)
Affinity DataIC50:  8nMpH: 7.5Assay Description:Assay method was adopted from a published protocol with some modifications to suit our requirements (Dmitry N Grigoryev et al, Analytical Biochemistr...
In DepthDetails US Patent
TargetSteroid 17-alpha-hydroxylase/17,20 lyase(Rattus norvegicus (Rat))
Novartis
US Patent
LigandPNGBDBM158428(US9029399, 1A | US9339501, 1A)
Affinity DataIC50:  2.70nMpH: 7.5Assay Description:Assay method was adopted from a published protocol with some modifications to suit our requirements (Dmitry N Grigoryev et al, Analytical Biochemistr...
In DepthDetails US Patent