BDBM158430 US9029399, 3A::US9339501, 3A
SMILES O=C1N(CCN1c1cnccc1C1CC1)c1ccc2ccccc2c1
InChI Key InChIKey=CLXFWWUVAHRQGQ-UHFFFAOYSA-N
Data  2 IC50
  Tab Delimited (TSV)   2D SDfile   Computed 3D by Vconf -m prep SDfile
Find this compound or compounds like it in BindingDB:
Activity Spreadsheet -- Enzyme Inhibition Constant Data from BindingDB
Found 2 hits for monomerid = 158430
TargetSteroid 17-alpha-hydroxylase/17,20 lyase(Homo sapiens (Human))
Novartis
US Patent
LigandPNGBDBM158430(US9029399, 3A | US9339501, 3A)
Affinity DataIC50:  26nMpH: 7.5Assay Description:Assay method was adopted from a published protocol with some modifications to suit our requirements (Dmitry N Grigoryev et al, Analytical Biochemistr...
In DepthDetails US Patent
TargetSteroid 17-alpha-hydroxylase/17,20 lyase(Homo sapiens (Human))
Novartis
US Patent
LigandPNGBDBM158430(US9029399, 3A | US9339501, 3A)
Affinity DataIC50:  26nMpH: 7.5Assay Description:Assay method was adopted from a published protocol with some modifications to suit our requirements (Dmitry N Grigoryev et al, Analytical Biochemistr...
In DepthDetails US Patent