BDBM158440 US9029399, 14A::US9339501, 14A
SMILES Fc1cc2cc(ccc2s1)N1CCN(C1=O)c1cnccc1C1CC1
InChI Key InChIKey=MXUZPNOHSJMPNN-UHFFFAOYSA-N
Data  2 IC50
  Tab Delimited (TSV)   2D SDfile   Computed 3D by Vconf -m prep SDfile
Find this compound or compounds like it in BindingDB:
Activity Spreadsheet -- Enzyme Inhibition Constant Data from BindingDB
Found 2 hits for monomerid = 158440
TargetSteroid 17-alpha-hydroxylase/17,20 lyase(Homo sapiens (Human))
Novartis
US Patent
LigandPNGBDBM158440(US9029399, 14A | US9339501, 14A)
Affinity DataIC50:  26nMpH: 7.5Assay Description:Assay method was adopted from a published protocol with some modifications to suit our requirements (Dmitry N Grigoryev et al, Analytical Biochemistr...
In DepthDetails US Patent
TargetSteroid 17-alpha-hydroxylase/17,20 lyase(Homo sapiens (Human))
Novartis
US Patent
LigandPNGBDBM158440(US9029399, 14A | US9339501, 14A)
Affinity DataIC50:  26nMpH: 7.5Assay Description:Assay method was adopted from a published protocol with some modifications to suit our requirements (Dmitry N Grigoryev et al, Analytical Biochemistr...
In DepthDetails US Patent