BDBM158494 US9029401, 2372
SMILES OC(=O)c1ccc(O[C@H]2CC[C@@H](CC2)NC(=O)Nc2ccc(cc2)C(F)(F)F)cc1
InChI Key InChIKey=WYKYOQIFUNOEFB-SAABIXHNSA-N
Data  2 IC50
  Tab Delimited (TSV)   2D SDfile   Computed 3D by Vconf -m prep SDfile
Find this compound or compounds like it in BindingDB:
Activity Spreadsheet -- Enzyme Inhibition Constant Data from BindingDB
Found 2 hits for monomerid = 158494
TargetRAF proto-oncogene serine/threonine-protein kinase(Homo sapiens (Human))
The Regents Of The University Of California
US Patent
LigandPNGBDBM158494(US9029401, 2372)
Affinity DataIC50: >1.00E+4nMpH: 7.5Assay Description:Inhibitor Concentration at 50% enzyme inhibition (IC50) values were calculated by quantifying the end-point ADP production from each kinase reaction ...
In DepthDetails US Patent
TargetBifunctional epoxide hydrolase 2(Homo sapiens (Human))
The Regents Of The University Of California
US Patent
LigandPNGBDBM158494(US9029401, 2372)
Affinity DataIC50:  0.900nM. Assay description: See reference (Jones, P. D.; Wolf, N. M.; Morisseau, C.; Whetstone, P.; Hock, B.; Hammock, B. D. Anal. Biochem. 343:66-75; 2005) for sEH assay.
In DepthDetails US Patent