BDBM1585 1 l-Cyclopropyl-5,ll-dihydro-4- [ (pheny1thio)methyl]-6H-dipyrid0[3,2-b:2 ,3 -e] [ 1,4]diazepin-6-one::2-cyclopropyl-7-[(phenylsulfanyl)methyl]-2,4,9,15-tetraazatricyclo[9.4.0.0^{3,8}]pentadeca-1(11),3,5,7,12,14-hexaen-10-one::Nevirapin 4-substituted deriv. 4h
SMILES O=C1Nc2c(CSc3ccccc3)ccnc2N(C2CC2)c2ncccc12
InChI Key InChIKey=UVEOQKOAQWOPQF-UHFFFAOYSA-N
Data  1 IC50
  Tab Delimited (TSV)   2D SDfile   Computed 3D by Vconf -m prep SDfile
Find this compound or compounds like it in BindingDB:
Activity Spreadsheet -- Enzyme Inhibition Constant Data from BindingDB
Found 1 hit for monomerid = 1585
TargetGag-Pol polyprotein [600-1027,R876K]/[600-1155](Human immunodeficiency virus type 1)
Boehringer Ingelheim Pharmaceuticals
LigandPNGBDBM1585(1 l-Cyclopropyl-5,ll-dihydro-4- [ (pheny1thio)meth...)
Affinity DataIC50:  1.03E+3nMpH: 7.8 T: 2°C. Assay description: The IC50 of reverse transcriptase is the concentration that inhibits 50% of recombinant HIV-1 RT RNA-directed DNA polymerase activity in vitro.
In DepthDetails ArticlePubMed