BDBM158666 US9034866, 141
SMILES CN1CCCC(O)(C#Cc2cc3-c4nc(cn4CCOc3cc2F)C(N)=O)C1=O
InChI Key InChIKey=RAVYVINYAQLBPY-UHFFFAOYSA-N
Data  2 KI
  Tab Delimited (TSV)   2D SDfile   Computed 3D by Vconf -m prep SDfile
Find this compound or compounds like it in BindingDB:
Activity Spreadsheet -- Enzyme Inhibition Constant Data from BindingDB
Found 2 hits for monomerid = 158666
TargetMitogen-activated protein kinase kinase kinase 14(Homo sapiens (Human))
Genentech
Curated by ChEMBL
LigandPNGBDBM158666(US9034866, 141)
Affinity DataKi:  3nM. Assay description: Inhibition of NIK (unknown origin) after 1 to 2 hrs by ADP-FP assay
In DepthDetails ArticlePubMed
TargetMitogen-activated protein kinase kinase kinase 14(Homo sapiens (Human))
Genentech
Curated by ChEMBL
LigandPNGBDBM158666(US9034866, 141)
Affinity DataKi:  5nMpH: 7.2Assay Description:The ability of the nuclear factor-kappa B (NF-kB)-inducing kinase (NIK) to catalyze the hydrolysis of adenosine-5'-triphosphate (ATP) was monitored u...
In DepthDetails US Patent