BDBM159100 US9682968, Example-2b(+)
SMILES Cc1cc(C)c2[nH]ccc2c1CN1CCC(O)CC1c1ccccc1
InChI Key
Data  1 IC50
  Tab Delimited (TSV)   2D SDfile   Computed 3D by Vconf -m prep SDfile
Find this compound or compounds like it in BindingDB:
Activity Spreadsheet -- Enzyme Inhibition Constant Data from BindingDB
Found 1 hit for monomerid = 159100
TargetComplement factor B(Homo sapiens (Human))
Novartis
US Patent
LigandPNGBDBM159100(US9682968, Example-2b(+))
Affinity DataIC50: >100nM. Assay description: CVF-Bb complex prepared from purified cobra venom factor (1 μM), recombinant human complement factor B (expressed in drosophila cells and purifi...
Ligand InfoPC cidPC sid
In DepthDetails US Patent