BDBM159188 US10195186, Example 37::US9682967, 35
SMILES Cc1cc(NC(=O)c2ccc(Br)cc2C(O)=O)ncn1
InChI Key InChIKey=NQYYTIFBQHUTBS-UHFFFAOYSA-N
Data  2 KI  2 IC50
  Tab Delimited (TSV)   2D SDfile   Computed 3D by Vconf -m prep SDfile
Find this compound or compounds like it in BindingDB:
Activity Spreadsheet -- Enzyme Inhibition Constant Data from BindingDB
Found 3 hits for monomerid = 159188
TargetSortilin(Homo sapiens (Human))
H. Lundbeck
US Patent
LigandPNGBDBM159188(US10195186, Example 37 | US9682967, 35)
Affinity DataKi:  1.24E+3nM. Assay description: The Sortilin assay was performed in total volume of 40 ul in 50 mM HEPES pH 7.4 assay buffer containing 100 mM NaCl, 2.0 mM CaCl2, 0.1% BSA and 0.1% ...
Ligand InfoPC cidPC sid
In DepthDetails US Patent
TargetSortilin(Homo sapiens (Human))
H. Lundbeck
US Patent
LigandPNGBDBM159188(US10195186, Example 37 | US9682967, 35)
Affinity DataKi:  1.91E+3nM IC50:  2.00E+3nMpH: 7.4Assay Description:The Sortilin assay was performed in total volume of 40 ul in 50 mM HEPES pH 7.4 assay buffer containing 100 mM NaCl, 2.0 mM CaCl2, 0.1% BSA and 0.1% ...
Ligand InfoPC cidPC sid
In DepthDetails US Patent
TargetSortilin(Homo sapiens (Human))
H. Lundbeck
US Patent
LigandPNGBDBM159188(US10195186, Example 37 | US9682967, 35)
Affinity DataIC50:  1.30E+3nM. Assay description: The Sortilin assay was performed in total volume of 40 ul in 50 mM HEPES pH 7.4 assay buffer containing 100 mM NaCl, 2.0 mM CaCl2, 0.1% BSA and 0.1% ...
Ligand InfoPC cidPC sid
In DepthDetails US Patent