BDBM159352 US9034907, 5
SMILES Cc1cncn1CCCn1c(=S)[nH]c2sc(C)c(C)c2c1=O
InChI Key InChIKey=QDYKVYPLCVABGE-UHFFFAOYSA-N
Data  1 KI  1 IC50
  Tab Delimited (TSV)   2D SDfile   Computed 3D by Vconf -m prep SDfile
Find this compound or compounds like it in BindingDB:
Activity Spreadsheet -- Enzyme Inhibition Constant Data from BindingDB
Found 1 hit for monomerid = 159352
TargetGlutaminyl-peptide cyclotransferase(Homo sapiens (Human))
Probiodrug
US Patent
LigandPNGBDBM159352(US9034907, 5)
Affinity DataKi:  24.1nM ΔG°:  -10.6kcal/mole IC50:  122nMpH: 8.0 T: 2°C. Assay description: Fluorometric Assays: All measurements were performed with a BioAssay Reader HTS-7000Plus for microplates (Perkin Elmer) at 30 C. QC activity was eval...
In DepthDetails US Patent