BDBM15950 Aminopyridine-Based Inhibitor 30::N-(4-Amino-5-cyano-6-ethoxypyridin-2-yl)-2-morpholin-4-ylacetamide::N-(4-amino-5-cyano-6-ethoxypyridin-2-yl)-2-(morpholin-4-yl)acetamide
SMILES CCOc1nc(NC(=O)CN2CCOCC2)cc(N)c1C#N
InChI Key InChIKey=XGCPEICJICGVBY-UHFFFAOYSA-N
Data  2 IC50
  Tab Delimited (TSV)   2D SDfile   Computed 3D by Vconf -m prep SDfile
Find this compound or compounds like it in BindingDB:
Activity Spreadsheet -- Enzyme Inhibition Constant Data from BindingDB
Found 2 hits for monomerid = 15950
TargetMitogen-activated protein kinase 9(Homo sapiens (Human))
Abbott Laboratories
LigandPNGBDBM15950(Aminopyridine-Based Inhibitor 30 | N-(4-Amino-5-cy...)
Affinity DataIC50:  1.20E+3nM. Assay description: In vitro substrate phosphorylation using purified recombinant JNK, was incubated with substrate, and test compounds in the presence of 5uM ATP/ [gamm...
In DepthDetails ArticlePubMed
TargetMitogen-activated protein kinase 8(Homo sapiens (Human))
Abbott Laboratories
LigandPNGBDBM15950(Aminopyridine-Based Inhibitor 30 | N-(4-Amino-5-cy...)
Affinity DataIC50:  270nM. Assay description: In vitro substrate phosphorylation using purified recombinant JNK, was incubated with substrate, and test compounds in the presence of 5uM ATP/ [gamm...
In DepthDetails ArticlePubMed