BDBM15955 Aminopyridine-Based Inhibitor 18a::N-(4-Amino-5-cyano-6-isopropoxypyridin-2-yl)acetamide::N-[4-amino-5-cyano-6-(propan-2-yloxy)pyridin-2-yl]acetamide
SMILES CC(C)Oc1nc(NC(C)=O)cc(N)c1C#N
InChI Key InChIKey=ZKMRRJOUWKSONY-UHFFFAOYSA-N
Data  2 IC50
  Tab Delimited (TSV)   2D SDfile   Computed 3D by Vconf -m prep SDfile
Find this compound or compounds like it in BindingDB:
Activity Spreadsheet -- Enzyme Inhibition Constant Data from BindingDB
Found 2 hits for monomerid = 15955
TargetMitogen-activated protein kinase 9(Homo sapiens (Human))
Abbott Laboratories
LigandPNGBDBM15955(Aminopyridine-Based Inhibitor 18a | N-(4-Amino-5-c...)
Affinity DataIC50:  470nM. Assay description: In vitro substrate phosphorylation using purified recombinant JNK, was incubated with substrate, and test compounds in the presence of 5uM ATP/ [gamm...
In DepthDetails ArticlePubMed
TargetMitogen-activated protein kinase 8(Homo sapiens (Human))
Abbott Laboratories
LigandPNGBDBM15955(Aminopyridine-Based Inhibitor 18a | N-(4-Amino-5-c...)
Affinity DataIC50:  310nM. Assay description: In vitro substrate phosphorylation using purified recombinant JNK, was incubated with substrate, and test compounds in the presence of 5uM ATP/ [gamm...
In DepthDetails ArticlePubMed