BDBM15972 Aminopyridine-Based Inhibitor 46::N-(6-ethoxypyridin-2-yl)acetamide
SMILES CCOc1cccc(NC(C)=O)n1
InChI Key InChIKey=NSIROEGSOFOSDV-UHFFFAOYSA-N
Data  2 IC50
  Tab Delimited (TSV)   2D SDfile   Computed 3D by Vconf -m prep SDfile
Find this compound or compounds like it in BindingDB:
Activity Spreadsheet -- Enzyme Inhibition Constant Data from BindingDB
Found 2 hits for monomerid = 15972
TargetMitogen-activated protein kinase 9(Homo sapiens (Human))
Abbott Laboratories
LigandPNGBDBM15972(Aminopyridine-Based Inhibitor 46 | N-(6-ethoxypyri...)
Affinity DataIC50: >1.00E+4nM. Assay description: In vitro substrate phosphorylation using purified recombinant JNK, was incubated with substrate, and test compounds in the presence of 5uM ATP/ [gamm...
In DepthDetails ArticlePubMed
TargetMitogen-activated protein kinase 8(Homo sapiens (Human))
Abbott Laboratories
LigandPNGBDBM15972(Aminopyridine-Based Inhibitor 46 | N-(6-ethoxypyri...)
Affinity DataIC50: >1.00E+4nM. Assay description: In vitro substrate phosphorylation using purified recombinant JNK, was incubated with substrate, and test compounds in the presence of 5uM ATP/ [gamm...
In DepthDetails ArticlePubMed