BDBM15999 2-({2-[(3-methylphenyl)amino]pyrimidin-4-yl}amino)benzoic acid::4-anilinopyrimidine 8h
SMILES Cc1cccc(Nc2nccc(Nc3ccccc3C(O)=O)n2)c1
InChI Key InChIKey=ROIWTEBVYRJZEG-UHFFFAOYSA-N
Data  1 IC50
  Tab Delimited (TSV)   2D SDfile   Computed 3D by Vconf -m prep SDfile
Find this compound or compounds like it in BindingDB:
Activity Spreadsheet -- Enzyme Inhibition Constant Data from BindingDB
Found 1 hit for monomerid = 15999
TargetMitogen-activated protein kinase 8(Homo sapiens (Human))
Abbott Laboratories
LigandPNGBDBM15999(2-({2-[(3-methylphenyl)amino]pyrimidin-4-yl}amino)...)
Affinity DataIC50:  157nM. Assay description: In vitro substrate phosphorylation using purified recombinant JNK, was incubated with substrate, and test compounds in the presence of 5uM ATP/ [gamm...
In DepthDetails ArticlePubMed