BDBM160116 US10047092, 57::US10053463, 57::US9040534, 57
SMILES C[C@H]1Cn2c(nnc2-c2cncc(C)c2)C(=O)N1Cc1cccc(c1Cl)C(F)(F)F
InChI Key InChIKey=QXFRMDKFZNAQJJ-LBPRGKRZSA-N
Data  4 KI  6 IC50
  Tab Delimited (TSV)   2D SDfile   Computed 3D by Vconf -m prep SDfile
Find this compound or compounds like it in BindingDB:
Activity Spreadsheet -- Enzyme Inhibition Constant Data from BindingDB
Found 10 hits for monomerid = 160116
TargetP2X purinoceptor 7(Mus musculus)
Janssen Pharmaceutica
US Patent
LigandPNGBDBM160116(US10047092, 57 | US10053463, 57 | US9040534, 57)
Affinity DataKi:  50.1nM. Assay description: human or rat P2X7-1321N1 cells were collected and frozen @−80° C. On the day of the experiment, cell membrane preparations were made according ...
In DepthDetails US Patent
TargetP2X purinoceptor 7(Homo sapiens (Human))
Janssen Pharmaceutica
US Patent
LigandPNGBDBM160116(US10047092, 57 | US10053463, 57 | US9040534, 57)
Affinity DataKi:  50.1nM. Assay description: human or rat P2X7-1321N1 cells were collected and frozen @ −80° C. On the day of the experiment, cell membrane preparations were made according...
In DepthDetails US Patent
TargetP2X purinoceptor 7(Homo sapiens (Human))
Janssen Pharmaceutica
US Patent
LigandPNGBDBM160116(US10047092, 57 | US10053463, 57 | US9040534, 57)
Affinity DataKi:  50.1nM. Assay description: human or rat P2X7-1321N1 cells were collected and frozen @−80° C. On the day of the experiment, cell membrane preparations were made according ...
In DepthDetails US Patent
TargetP2X purinoceptor 7(Homo sapiens (Human))
Janssen Pharmaceutica
US Patent
LigandPNGBDBM160116(US10047092, 57 | US10053463, 57 | US9040534, 57)
Affinity DataKi:  50.1nM. Assay description: Radioligand binding: human or rat P2X7-1321N1 cells were collected and frozen @ −80° C. On the day of the experiment, cell membrane preparation...
In DepthDetails US Patent
TargetP2X purinoceptor 7(Mus musculus)
Janssen Pharmaceutica
US Patent
LigandPNGBDBM160116(US10047092, 57 | US10053463, 57 | US9040534, 57)
Affinity DataIC50: >1.00E+4nMpH: 7.4Assay Description:1321N1 cells expressing the recombinant human or rat P2X7 channel was cultured in HyQ DME/(HyClone/Dulbecco's Modified Eagle Medium) high glucose...
In DepthDetails US Patent
TargetP2X purinoceptor 7(Homo sapiens (Human))
Janssen Pharmaceutica
US Patent
LigandPNGBDBM160116(US10047092, 57 | US10053463, 57 | US9040534, 57)
Affinity DataIC50:  219nMpH: 7.4Assay Description:1321N1 cells expressing the recombinant human or rat P2X7 channel was cultured in HyQ DME/(HyClone/Dulbecco's Modified Eagle Medium) high glucose...
In DepthDetails US Patent
TargetP2X purinoceptor 7(Rattus norvegicus (Rat))
Janssen Pharmaceutica
US Patent
LigandPNGBDBM160116(US10047092, 57 | US10053463, 57 | US9040534, 57)
Affinity DataIC50: >1.00E+4nMpH: 7.4Assay Description:1321N1 cells expressing the recombinant human, rat or mouse P2X7 channel was cultured in HyQ DME/(HyClone/Dulbecco's Modified Eagle Medium) high ...
In DepthDetails US Patent
TargetP2X purinoceptor 7(Rattus norvegicus (Rat))
Janssen Pharmaceutica
US Patent
LigandPNGBDBM160116(US10047092, 57 | US10053463, 57 | US9040534, 57)
Affinity DataIC50: >1.00E+4nMpH: 7.4Assay Description:Ca2+ Flux: 1321N1 cells expressing the recombinant human, rat or mouse P2X7 channel was cultured in HyQ DME/(HyClone/Dulbecco's Modified Eagle Medium...
In DepthDetails US Patent
TargetP2X purinoceptor 7(Homo sapiens (Human))
Janssen Pharmaceutica
US Patent
LigandPNGBDBM160116(US10047092, 57 | US10053463, 57 | US9040534, 57)
Affinity DataIC50:  219nMpH: 7.4Assay Description:Ca2+ Flux: 1321N1 cells expressing the recombinant human, rat or mouse P2X7 channel was cultured in HyQ DME/(HyClone/Dulbecco's Modified Eagle Medium...
In DepthDetails US Patent
TargetP2X purinoceptor 7(Homo sapiens (Human))
Janssen Pharmaceutica
US Patent
LigandPNGBDBM160116(US10047092, 57 | US10053463, 57 | US9040534, 57)
Affinity DataIC50:  219nMpH: 7.4Assay Description:1321N1 cells expressing the recombinant human, rat or mouse P2X7 channel was cultured in HyQ DME/(HyClone/Dulbecco's Modified Eagle Medium) high ...
In DepthDetails US Patent