BDBM160127 US10047092, 68::US10053463, 68::US9040534, 68
SMILES FC(F)(F)c1cccc(CN2C(Cn3c(nnc3C2=O)-c2cc[nH]n2)C2CC2)c1Cl
InChI Key
Data  4 KI  6 IC50
  Tab Delimited (TSV)   2D SDfile   Computed 3D by Vconf -m prep SDfile
Find this compound or compounds like it in BindingDB:
Activity Spreadsheet -- Enzyme Inhibition Constant Data from BindingDB
Found 10 hits for monomerid = 160127
TargetP2X purinoceptor 7(Mus musculus)
Janssen Pharmaceutica
US Patent
LigandPNGBDBM160127(US10047092, 68 | US10053463, 68 | US9040534, 68)
Affinity DataKi:  4nM. Assay description: human or rat P2X7-1321N1 cells were collected and frozen @−80° C. On the day of the experiment, cell membrane preparations were made according ...
In DepthDetails US Patent
TargetP2X purinoceptor 7(Homo sapiens (Human))
Janssen Pharmaceutica
US Patent
LigandPNGBDBM160127(US10047092, 68 | US10053463, 68 | US9040534, 68)
Affinity DataKi:  4nM. Assay description: human or rat P2X7-1321N1 cells were collected and frozen @ −80° C. On the day of the experiment, cell membrane preparations were made according...
In DepthDetails US Patent
TargetP2X purinoceptor 7(Homo sapiens (Human))
Janssen Pharmaceutica
US Patent
LigandPNGBDBM160127(US10047092, 68 | US10053463, 68 | US9040534, 68)
Affinity DataKi:  4nM. Assay description: human or rat P2X7-1321N1 cells were collected and frozen @−80° C. On the day of the experiment, cell membrane preparations were made according ...
In DepthDetails US Patent
TargetP2X purinoceptor 7(Homo sapiens (Human))
Janssen Pharmaceutica
US Patent
LigandPNGBDBM160127(US10047092, 68 | US10053463, 68 | US9040534, 68)
Affinity DataKi:  4nM. Assay description: Radioligand binding: human or rat P2X7-1321N1 cells were collected and frozen @ −80° C. On the day of the experiment, cell membrane preparation...
In DepthDetails US Patent
TargetP2X purinoceptor 7(Mus musculus)
Janssen Pharmaceutica
US Patent
LigandPNGBDBM160127(US10047092, 68 | US10053463, 68 | US9040534, 68)
Affinity DataIC50:  11.8nMpH: 7.4Assay Description:1321N1 cells expressing the recombinant human or rat P2X7 channel was cultured in HyQ DME/(HyClone/Dulbecco's Modified Eagle Medium) high glucose...
In DepthDetails US Patent
TargetP2X purinoceptor 7(Homo sapiens (Human))
Janssen Pharmaceutica
US Patent
LigandPNGBDBM160127(US10047092, 68 | US10053463, 68 | US9040534, 68)
Affinity DataIC50:  1.10nMpH: 7.4Assay Description:1321N1 cells expressing the recombinant human or rat P2X7 channel was cultured in HyQ DME/(HyClone/Dulbecco's Modified Eagle Medium) high glucose...
In DepthDetails US Patent
TargetP2X purinoceptor 7(Rattus norvegicus (Rat))
Janssen Pharmaceutica
US Patent
LigandPNGBDBM160127(US10047092, 68 | US10053463, 68 | US9040534, 68)
Affinity DataIC50:  11.8nMpH: 7.4Assay Description:1321N1 cells expressing the recombinant human, rat or mouse P2X7 channel was cultured in HyQ DME/(HyClone/Dulbecco's Modified Eagle Medium) high ...
In DepthDetails US Patent
TargetP2X purinoceptor 7(Rattus norvegicus (Rat))
Janssen Pharmaceutica
US Patent
LigandPNGBDBM160127(US10047092, 68 | US10053463, 68 | US9040534, 68)
Affinity DataIC50:  11.8nMpH: 7.4Assay Description:Ca2+ Flux: 1321N1 cells expressing the recombinant human, rat or mouse P2X7 channel was cultured in HyQ DME/(HyClone/Dulbecco's Modified Eagle Medium...
In DepthDetails US Patent
TargetP2X purinoceptor 7(Homo sapiens (Human))
Janssen Pharmaceutica
US Patent
LigandPNGBDBM160127(US10047092, 68 | US10053463, 68 | US9040534, 68)
Affinity DataIC50:  1.10nMpH: 7.4Assay Description:Ca2+ Flux: 1321N1 cells expressing the recombinant human, rat or mouse P2X7 channel was cultured in HyQ DME/(HyClone/Dulbecco's Modified Eagle Medium...
In DepthDetails US Patent
TargetP2X purinoceptor 7(Homo sapiens (Human))
Janssen Pharmaceutica
US Patent
LigandPNGBDBM160127(US10047092, 68 | US10053463, 68 | US9040534, 68)
Affinity DataIC50:  1.10nMpH: 7.4Assay Description:1321N1 cells expressing the recombinant human, rat or mouse P2X7 channel was cultured in HyQ DME/(HyClone/Dulbecco's Modified Eagle Medium) high ...
In DepthDetails US Patent