BDBM160534 US10280160, Example 26.::US9682969, 26
SMILES CN(C(=O)Cn1nc(-c2cccc(Cl)c2)c2ccc(OC3CCCCC3)cc2c1=O)c1ccc2nc(C)oc2c1
InChI Key InChIKey=IYEFVRHTAWRFDE-UHFFFAOYSA-N
Data  2 EC50
  Tab Delimited (TSV)   2D SDfile   Computed 3D by Vconf -m prep SDfile
Find this compound or compounds like it in BindingDB:
Activity Spreadsheet -- Enzyme Inhibition Constant Data from BindingDB
Found 2 hits for monomerid = 160534
TargetCystic fibrosis transmembrane conductance regulator(Homo sapiens (Human))
Flatley Discovery Lab
US Patent
LigandPNGBDBM160534(US10280160, Example 26. | US9682969, 26)
Affinity DataEC50: <1.00E+4nM. Assay description: Fisher Rat Thyroid (FRT) cells stably expressing both human F508del CFTR and a halide-sensitive yellow fluorescent protein (YFP-H148Q/I152L 25,22) (G...
Ligand InfoPC cidPC sid
In DepthDetails US Patent
TargetCystic fibrosis transmembrane conductance regulator [1-507,509-1480](Homo sapiens (Human))
Flatley Discovery Lab
US Patent
LigandPNGBDBM160534(US10280160, Example 26. | US9682969, 26)
Affinity DataEC50: <1.00E+4nM. Assay description: This protocol is designed to selectively screen small molecule compounds for F508del CFTR corrector activities in the YFP (yellow fluorescent protein...
Ligand InfoPC cidPC sid
In DepthDetails US Patent