BDBM160801 US10167313, Compound 68::US9045524, 68
SMILES CC(C)[C@H](NC(=O)[C@@H](NC(=O)[C@H](CC(O)=O)NC(=O)OCc1ccccc1)C1Cc2ccccc2C1)C(=O)N[C@@H](CC(O)=O)\C=C\S(=O)(=O)C(C)C
InChI Key InChIKey=XEWZRZSJGJZHSY-QVZFUARWSA-N
Data  10 IC50
  Tab Delimited (TSV)   2D SDfile   Computed 3D by Vconf -m prep SDfile
Find this compound or compounds like it in BindingDB:
Activity Spreadsheet -- Enzyme Inhibition Constant Data from BindingDB
Found 10 hits for monomerid = 160801
TargetCaspase-1(Homo sapiens (Human))
Novagenesis Foundation
US Patent
LigandPNGBDBM160801(US10167313, Compound 68 | US9045524, 68)
Affinity DataIC50: >3.33E+3nMT: 2°C. Assay description: Selectivity of compound 55, compound 63, compound 48, compound 57, compound 88 toward caspase-1 (pro-inflammatory group), caspase-5 (group I), caspas...
In DepthDetails US Patent
TargetCaspase-5(Homo sapiens (Human))
Novagenesis Foundation
US Patent
LigandPNGBDBM160801(US10167313, Compound 68 | US9045524, 68)
Affinity DataIC50: >3.33E+3nMT: 2°C. Assay description: Selectivity of compound 55, compound 63, compound 48, compound 57, compound 88 toward caspase-1 (pro-inflammatory group), caspase-5 (group I), caspas...
In DepthDetails US Patent
TargetCaspase-7(Homo sapiens (Human))
Novagenesis Foundation
US Patent
LigandPNGBDBM160801(US10167313, Compound 68 | US9045524, 68)
Affinity DataIC50:  1.50E+3nMT: 2°C. Assay description: Selectivity of compound 55, compound 63, compound 48, compound 57, compound 88 toward caspase-1 (pro-inflammatory group), caspase-5 (group I), caspas...
In DepthDetails US Patent
TargetCaspase-9(Homo sapiens (Human))
Novagenesis Foundation
US Patent
LigandPNGBDBM160801(US10167313, Compound 68 | US9045524, 68)
Affinity DataIC50: >3.33E+3nMT: 2°C. Assay description: Selectivity of compound 55, compound 63, compound 48, compound 57, compound 88 toward caspase-1 (pro-inflammatory group), caspase-5 (group I), caspas...
In DepthDetails US Patent
TargetCaspase-9(Homo sapiens (Human))
Novagenesis Foundation
US Patent
LigandPNGBDBM160801(US10167313, Compound 68 | US9045524, 68)
Affinity DataIC50: >3.33E+3nM. Assay description: Selectivity of compound 55, compound 63, compound 48, compound 57, compound 88 toward caspase-1 (pro-inflammatory group), caspase-5 (group I), caspas...
In DepthDetails US Patent
TargetCaspase-1(Homo sapiens (Human))
Novagenesis Foundation
US Patent
LigandPNGBDBM160801(US10167313, Compound 68 | US9045524, 68)
Affinity DataIC50: >3.33E+3nM. Assay description: Selectivity of compound 55, compound 63, compound 48, compound 57, compound 88 toward caspase-1 (pro-inflammatory group), caspase-5 (group I), caspas...
In DepthDetails US Patent
TargetCaspase-3(Homo sapiens (Human))
Genesis Technologies
US Patent
LigandPNGBDBM160801(US10167313, Compound 68 | US9045524, 68)
Affinity DataIC50:  200nM. Assay description: Selectivity of compound 55, compound 63, compound 48, compound 57, compound 88 toward caspase-1 (pro-inflammatory group), caspase-5 (group I), caspas...
In DepthDetails US Patent
TargetCaspase-5(Homo sapiens (Human))
Novagenesis Foundation
US Patent
LigandPNGBDBM160801(US10167313, Compound 68 | US9045524, 68)
Affinity DataIC50: >3.33E+3nM. Assay description: Selectivity of compound 55, compound 63, compound 48, compound 57, compound 88 toward caspase-1 (pro-inflammatory group), caspase-5 (group I), caspas...
In DepthDetails US Patent
TargetCaspase-7(Homo sapiens (Human))
Novagenesis Foundation
US Patent
LigandPNGBDBM160801(US10167313, Compound 68 | US9045524, 68)
Affinity DataIC50:  1.50E+3nM. Assay description: Selectivity of compound 55, compound 63, compound 48, compound 57, compound 88 toward caspase-1 (pro-inflammatory group), caspase-5 (group I), caspas...
In DepthDetails US Patent
TargetCaspase-3(Homo sapiens (Human))
Genesis Technologies
US Patent
LigandPNGBDBM160801(US10167313, Compound 68 | US9045524, 68)
Affinity DataIC50:  200nM. Assay description: To test the efficacy of caspase-3 inhibitors at the cellular level, the ability of selected compounds to inhibit the proteolytic cleavage of PARP (po...
In DepthDetails US Patent