BDBM160818 US9682980, 2-(1-(3-(2,2,2-Trifluoroethyl)-8-(trifluoromethyl)-[1,2,4]triazolo[4,3-b]pyridazin-7-yl)piperidin-4-yl)benzonitrile
SMILES FC(F)(F)Cc1nnc2c(c(cnn12)N1CCC(CC1)c1ccccc1C#N)C(F)(F)F
InChI Key InChIKey=VCOSPCSHOLQJJB-UHFFFAOYSA-N
Data  1 EC50
  Tab Delimited (TSV)   2D SDfile   Computed 3D by Vconf -m prep SDfile
Find this compound or compounds like it in BindingDB:
Activity Spreadsheet -- Enzyme Inhibition Constant Data from BindingDB
Found 1 hit for monomerid = 160818
TargetMetabotropic glutamate receptor 2(Homo sapiens (Human))
Bristol-Myers Squibb
US Patent
LigandPNGBDBM160818(US9682980, 2-(1-(3-(2,2,2-Trifluoroethyl)-8-(trifl...)
Affinity DataEC50:  7nMpH: 7.0Assay Description:Clonally expressed human mGluR2 in HEK293 background was glutamate starved overnight in media without glutamine (GIBCO MEM 12360), containing 10% FBS...
Ligand InfoPC cidPC sid
In DepthDetails US Patent