BDBM160935 US10167299, Maraviroc::US9107954, maraviroc
SMILES CC(C)c1nnc(C)n1C1CC2CCC(C1)N2CC[C@H](NC(=O)C1CCC(F)(F)CC1)c1ccccc1
InChI Key InChIKey=GSNHKUDZZFZSJB-ILVMPNSOSA-N
Data  1 KI  3 IC50
  Tab Delimited (TSV)   2D SDfile   Computed 3D by Vconf -m prep SDfile
Find this compound or compounds like it in BindingDB:
Activity Spreadsheet -- Enzyme Inhibition Constant Data from BindingDB
Found 4 hits for monomerid = 160935
TargetC-C chemokine receptor type 5(Homo sapiens (Human))
Virginia Commonwealth University
US Patent
LigandPNGBDBM160935(US10167299, Maraviroc | US9107954, maraviroc)
Affinity DataKi:  0.240nM. Assay description: Afterwards, the pharmacological profile of bivalent ligand 1 at the chemokine receptor CCR5 was characterized similarly. The competitive radioligand ...
In DepthDetails US Patent
TargetC-C chemokine receptor type 5(Homo sapiens (Human))
Virginia Commonwealth University
US Patent
LigandPNGBDBM160935(US10167299, Maraviroc | US9107954, maraviroc)
Affinity DataIC50:  7.38nM. Assay description: 1. HEK293 cells which can stably express CCR5 were inoculated in a 96-well plate and incubated overnight.2. The medium in each well into which cells ...
In DepthDetails US Patent
TargetPotassium voltage-gated channel subfamily H member 2(Homo sapiens (Human))
Shanghai Institute Of Material Medica, Chinese Academy Of Sciences
US Patent
LigandPNGBDBM160935(US10167299, Maraviroc | US9107954, maraviroc)
Affinity DataIC50:  7.75E+3nM. Assay description: 1. CHO-hERG cells which have been incubated overnight were added with sample buffer and incubated for 90 minutes at room temperature in darkness.2. T...
In DepthDetails US Patent
TargetC-C chemokine receptor type 5(Homo sapiens (Human))
Virginia Commonwealth University
US Patent
LigandPNGBDBM160935(US10167299, Maraviroc | US9107954, maraviroc)
Affinity DataIC50:  2.20nM. Assay description: Then the Ca2+ functional activity of bivalent ligand 1 was evaluated in the Gqi5 transfected CCR5-MOLT-4 cells as described in the literature.3 As ex...
In DepthDetails US Patent