BDBM161072 US9682976, 26
SMILES Cn1nnn(-c2cc(Nc3ncc(F)c(N[C@H]4CCN5C(CCC5(C)C)C4)n3)c(F)cc2C2CC2)c1=O
InChI Key InChIKey=YMPMUCHDYTYALL-VYRBHSGPSA-N
Data  1 EC50
  Tab Delimited (TSV)   2D SDfile   Computed 3D by Vconf -m prep SDfile
Find this compound or compounds like it in BindingDB:
Activity Spreadsheet -- Enzyme Inhibition Constant Data from BindingDB
Found 1 hit for monomerid = 161072
TargetInterleukin-2(Homo sapiens (Human))
Rigel Pharmaceuticals
US Patent
LigandPNGBDBM161072(US9682976, 26)
Affinity DataEC50: <1.00E+4nM. Assay description: Primary T cell stimulation and IL2 ELISA: Human primary T cells (100,000 cells per well) were pre-incubated with or without test compound in Yssel...
Ligand InfoPC cidPC sid
In DepthDetails US Patent