BDBM161116 US9051265, 22
SMILES CCC(NC(=O)c1ccc2n(Cc3ccc(Cl)cc3)c(C)c(C)c2c1)c1ccccc1
InChI Key InChIKey=GHEAQIVVPNEMLM-UHFFFAOYSA-N
Data  1 IC50
  Tab Delimited (TSV)   2D SDfile   Computed 3D by Vconf -m prep SDfile
Find this compound or compounds like it in BindingDB:
Activity Spreadsheet -- Enzyme Inhibition Constant Data from BindingDB
Found 1 hit for monomerid = 161116
TargetPeroxisome proliferator-activated receptor gamma(Homo sapiens (Human))
The Scripps Research Institute
US Patent
LigandPNGBDBM161116(US9051265, 22)
Affinity DataIC50:  29nM. Assay description: The assay was performed according to manufacturer protocol. A mixture of 5 nM GST-PPARG-LBD, 5 nM Tb-GST-antibody, 5 nM Fluormone Pan- PPAR Green, an...
In DepthDetails US Patent