BDBM161327 BDBM288026::US10738009, Compound 112::US11673864, Compound 112::US9051270, 112::US9758483, Compound 112
SMILES Cc1cc(F)ccc1Oc1cc(ccc1C(=O)Nc1cc[nH]c(=O)c1)C(F)(F)C(F)(F)F
InChI Key InChIKey=OGNHUCWKIBGDPU-UHFFFAOYSA-N
Data  5 IC50
  Tab Delimited (TSV)   2D SDfile   Computed 3D by Vconf -m prep SDfile
Find this compound or compounds like it in BindingDB:
Activity Spreadsheet -- Enzyme Inhibition Constant Data from BindingDB
Found 5 hits for monomerid = 161327
TargetSodium channel protein type 10 subunit alpha(Rattus norvegicus (Rat))
Vertex Pharmaceuticals
US Patent
LigandPNGBDBM161327(BDBM288026 | US10738009, Compound 112 | US11673864...)
Affinity DataIC50:  16nM. Assay description: Patch clamp electrophysiology was used to assess the efficacy and selectivity of sodium channel blockers in dorsal root ganglion neurons. Rat neurons...
In DepthDetails US Patent
TargetSodium channel protein type 10 subunit alpha(Homo sapiens (Human))
Vertex Pharmaceuticals
US Patent
LigandPNGBDBM161327(BDBM288026 | US10738009, Compound 112 | US11673864...)
Affinity DataIC50:  16nM. Assay description: Sodium channels are voltage-dependent proteins that can be activated by inducing membrane voltage changes by applying electric fields. The electrical...
In DepthDetails US Patent
TargetSodium channel protein type 8 subunit alpha(Homo sapiens (Human))
Vertex Pharmaceuticals
US Patent
LigandPNGBDBM161327(BDBM288026 | US10738009, Compound 112 | US11673864...)
Affinity DataIC50:  16nM. Assay description: 1) Pre-spotted compounds (in neat DMSO) into compound plates. Vehicle control (neat DMSO), the positive control (20 mM DMSO stock tetracaine, 125 ...
In DepthDetails US Patent
TargetSodium channel protein type 10 subunit alpha(Homo sapiens (Human))
Vertex Pharmaceuticals
US Patent
LigandPNGBDBM161327(BDBM288026 | US10738009, Compound 112 | US11673864...)
Affinity DataIC50:  16nM. Assay description: Patch clamp electrophysiology was used to assess the efficacy and selectivity of sodium channel blockers in dorsal root ganglion neurons. Rat neurons...
In DepthDetails US Patent
TargetSodium channel protein type 10 subunit alpha(Homo sapiens (Human))
Vertex Pharmaceuticals
US Patent
LigandPNGBDBM161327(BDBM288026 | US10738009, Compound 112 | US11673864...)
Affinity DataIC50:  16nM. Assay description: 1) Pre-spotted compounds (in neat DMSO) into compound plates. Vehicle control (neat DMSO), the positive control (20 mM DMSO stock tetracaine, 125 ...
In DepthDetails US Patent