BDBM161484 US9108983, Example 12
SMILES Cc1c(cc(-c2cc(F)ccc2C(=O)N2Cc3ccccc3C[C@H]2CN2CCOCC2)n1C)C(=O)N(c1ccc(O)cc1)c1ccc2n(C)ncc2c1
InChI Key InChIKey=KPIWDPLEFPTFDX-UMSFTDKQSA-N
Data  1 IC50
  Tab Delimited (TSV)   2D SDfile   Computed 3D by Vconf -m prep SDfile
Find this compound or compounds like it in BindingDB:
Activity Spreadsheet -- Enzyme Inhibition Constant Data from BindingDB
Found 1 hit for monomerid = 161484
TargetApoptosis regulator Bcl-2(Homo sapiens (Human))
Les Laboratoires Servier
US Patent
LigandPNGBDBM161484(US9108983, Example 12)
Affinity DataIC50:  5.5nMpH: 7.4Assay Description:The fluorescence polarisation tests were carried out on microplates (384 wells). The Bcl-2 protein, labelled (histag-Bcl-2 such that Bcl-2 correspond...
In DepthDetails US Patent