BDBM161496 US9108983, Example 27
SMILES C[C@@H]1Cc2ccccc2CN1C(=O)c1cc2OCOc2cc1-c1cc(C(=O)N(c2cnn(C)c2)c2ccc(O)cc2)c(C)n1CCN(C)C
InChI Key InChIKey=IESOLVCFNHARQG-XMMPIXPASA-N
Data  1 IC50
  Tab Delimited (TSV)   2D SDfile   Computed 3D by Vconf -m prep SDfile
Find this compound or compounds like it in BindingDB:
Activity Spreadsheet -- Enzyme Inhibition Constant Data from BindingDB
Found 1 hit for monomerid = 161496
TargetApoptosis regulator Bcl-2(Homo sapiens (Human))
Les Laboratoires Servier
US Patent
LigandPNGBDBM161496(US9108983, Example 27)
Affinity DataIC50:  5.20nMpH: 7.4Assay Description:The fluorescence polarisation tests were carried out on microplates (384 wells). The Bcl-2 protein, labelled (histag-Bcl-2 such that Bcl-2 correspond...
In DepthDetails US Patent