BDBM161671 US9682976, 130
SMILES CC1(C)C[C@@H](C[C@@H]2CCCN12)Nc1nc(Nc2ccc(OCCO)c(F)c2)ncc1F
InChI Key InChIKey=ZGONEAOARUJJOU-CVEARBPZSA-N
Data  1 EC50
  Tab Delimited (TSV)   2D SDfile   Computed 3D by Vconf -m prep SDfile
Find this compound or compounds like it in BindingDB:
Activity Spreadsheet -- Enzyme Inhibition Constant Data from BindingDB
Found 1 hit for monomerid = 161671
TargetInterleukin-2(Homo sapiens (Human))
Rigel Pharmaceuticals
US Patent
LigandPNGBDBM161671(US9682976, 130)
Affinity DataEC50: <1.00E+3nM. Assay description: Primary T cell stimulation and IL2 ELISA: Human primary T cells (100,000 cells per well) were pre-incubated with or without test compound in Yssel...
Ligand InfoPC cidPC sid
In DepthDetails US Patent