BDBM161702 US9682976, 153
SMILES CC1(C)C[C@@H](C[C@@H]2CCCN12)Nc1nc(Nc2cccc(c2)C#N)ncc1Cl
InChI Key InChIKey=NRIZOVPQKMPULJ-SJORKVTESA-N
Data  1 EC50
  Tab Delimited (TSV)   2D SDfile   Computed 3D by Vconf -m prep SDfile
Find this compound or compounds like it in BindingDB:
Activity Spreadsheet -- Enzyme Inhibition Constant Data from BindingDB
Found 1 hit for monomerid = 161702
TargetInterleukin-2(Homo sapiens (Human))
Rigel Pharmaceuticals
US Patent
LigandPNGBDBM161702(US9682976, 153)
Affinity DataEC50: <500nM. Assay description: Primary T cell stimulation and IL2 ELISA: Human primary T cells (100,000 cells per well) were pre-incubated with or without test compound in Yssel...
Ligand InfoPC cidPC sid
In DepthDetails US Patent