BDBM161833 US9682976, 270
SMILES CS(=O)c1nnnn1-c1cccc(Nc2ncc(F)c(N[C@@H]3C[C@@H]4CCCN4C(C)(C)C3)n2)c1
InChI Key InChIKey=IPVMQWOBFJQJGA-JTISZYJISA-N
Data  1 EC50
  Tab Delimited (TSV)   2D SDfile   Computed 3D by Vconf -m prep SDfile
Find this compound or compounds like it in BindingDB:
Activity Spreadsheet -- Enzyme Inhibition Constant Data from BindingDB
Found 1 hit for monomerid = 161833
TargetInterleukin-2(Homo sapiens (Human))
Rigel Pharmaceuticals
US Patent
LigandPNGBDBM161833(US9682976, 270)
Affinity DataEC50: <1.00E+3nM. Assay description: Primary T cell stimulation and IL2 ELISA: Human primary T cells (100,000 cells per well) were pre-incubated with or without test compound in Yssel...
Ligand InfoPC cidPC sid
In DepthDetails US Patent